Target
Tyrosine-protein kinase HCK
Ligand
BDBM14806
Substrate
Meas. Tech.
In Vitro Kinase Assay
Temperature
298.15±0 K
IC50
>3.0e+4±n/a nM
Citation
 Emert-Sedlak, LKodama, TLerner, ECDai, WFoster, CDay, BWLazo, JSSmithgall, TE Chemical library screens targeting an HIV-1 accessory factor/host cell kinase complex identify novel antiretroviral compounds. ACS Chem Biol 4:939-47 (2009)  
Target
Name:
Tyrosine-protein kinase HCK
Synonyms:
HCK Hematopoietic cell kinase p59-HCK/p60-HCK p61Hck
Type:
Enzyme Catalytic Domain
Mol. Mass.:
59600.18
Organism:
Homo sapiens (Human)
Description:
P08631
Residue:
526
  
Inhibitor
Name:
BDBM14806
Synonyms:
5,6-Diphenyl-furo[2,3-d]pyrimidin-4 -ylamine DFP-4A | furanopyrimidine compound 8
Type:
Small organic molecule
Emp. Form.:
C18H13N3O
Mol. Mass.:
287.3153
SMILES:
Nc1ncnc2oc(c(-c3ccccc3)c12)-c1ccccc1
: