Target
chymase
Ligand
BDBM88377
Substrate
Meas. Tech.
Enzymatic Chymase Assay
pH
7.5±n/a
IC50
3.50±n/a nM
Comments
extracted
Citation
 Fürstner, CAckerstaff, JStraub, AMeier, HTinel, HZimmermann, KZubov, DSchamberger, J Substituted uracils as chymase inhibitors US Patent  US9695131 Publication Date 7/4/2017 
Target
Name:
chymase
Synonyms:
Type:
Enzyme
Mol. Mass.:
27507.42
Organism:
Mesocricetus auratus (Golden hamster)
Description:
A0A1U7QTH6
Residue:
247
  
Inhibitor
Name:
BDBM88377
Synonyms:
US9695131, 14
Type:
Small organic molecule
Emp. Form.:
C23H16F3N7O4
Mol. Mass.:
511.4128
SMILES:
Cn1c2ccc(cc2oc1=O)-n1cc(-c2nnn[nH]2)c(=O)n(C2CCc3c2cccc3C(F)(F)F)c1=O
: