Target
chymase
Ligand
BDBM88379
Substrate
Meas. Tech.
Enzymatic Chymase Assay
pH
7.5±n/a
IC50
2.80±n/a nM
Comments
extracted
Citation
 Fürstner, CAckerstaff, JStraub, AMeier, HTinel, HZimmermann, KZubov, DSchamberger, J Substituted uracils as chymase inhibitors US Patent  US9695131 Publication Date 7/4/2017 
Target
Name:
chymase
Synonyms:
Type:
Enzyme
Mol. Mass.:
27507.42
Organism:
Mesocricetus auratus (Golden hamster)
Description:
A0A1U7QTH6
Residue:
247
  
Inhibitor
Name:
BDBM88379
Synonyms:
US9695131, 16 US9695131, 18
Type:
Small organic molecule
Emp. Form.:
C23H19ClN8O3
Mol. Mass.:
490.902
SMILES:
Cn1c2ccc(cc2n(C)c1=O)-n1cc(-c2nnn[nH]2)c(=O)n(C2CCc3c2cccc3Cl)c1=O
: