Target
chymase
Ligand
BDBM88396
Substrate
Meas. Tech.
Enzymatic Chymase Assay
pH
7.5±n/a
IC50
4.90±n/a nM
Comments
extracted
Citation
 Fürstner, CAckerstaff, JStraub, AMeier, HTinel, HZimmermann, KZubov, DSchamberger, J Substituted uracils as chymase inhibitors US Patent  US9695131 Publication Date 7/4/2017 
Target
Name:
chymase
Synonyms:
Type:
Enzyme
Mol. Mass.:
27507.42
Organism:
Mesocricetus auratus (Golden hamster)
Description:
A0A1U7QTH6
Residue:
247
  
Inhibitor
Name:
BDBM88396
Synonyms:
US9695131, 33
Type:
Small organic molecule
Emp. Form.:
C24H19F3N6O5
Mol. Mass.:
528.4401
SMILES:
Cc1c(Cn2c(=O)c(cn(-c3ccc4n(C)c(=O)n(C)c4c3)c2=O)-c2noc(=O)[nH]2)cccc1C(F)(F)F
: