Target
Beta-lactamase
Ligand
BDBM36641
Substrate
Meas. Tech.
Metallo-Beta-Lactamase Assay
pH
7±0
Temperature
310.15±0 K
IC50
4.2e+4± 7e+3 nM
Citation
 Toney, JHFitzgerald, PMGrover-Sharma, NOlson, SHMay, WJSundelof, JGVanderwall, DECleary, KAGrant, SKWu, JKKozarich, JWPompliano, DLHammond, GG Antibiotic sensitization using biphenyl tetrazoles as potent inhibitors of Bacteroides fragilis metallo-beta-lactamase. Chem Biol 5:185-96 (1998)  
Target
Name:
Beta-lactamase
Synonyms:
Metallo-beta-lactamase
Type:
Protein
Mol. Mass.:
27160.75
Organism:
Bacteroides fragilis
Description:
Q8KZP2
Residue:
249
  
Inhibitor
Name:
BDBM36641
Synonyms:
L-809,339
Type:
Small organic molecule
Emp. Form.:
C26H21N5O
Mol. Mass.:
419.4778
SMILES:
C(Oc1ccc2c3CCC=Cc3[nH]c2c1)c1ccc(cc1)-c1ccccc1-c1nnn[nH]1
: