Target
Dipeptidase 1
Ligand
BDBM36644
Substrate
Meas. Tech.
Dehydropeptidase I Assay
pH
7±0
Temperature
310.15±0 K
IC50
>1.00e+5±n/a nM
Citation
 Toney, JHFitzgerald, PMGrover-Sharma, NOlson, SHMay, WJSundelof, JGVanderwall, DECleary, KAGrant, SKWu, JKKozarich, JWPompliano, DLHammond, GG Antibiotic sensitization using biphenyl tetrazoles as potent inhibitors of Bacteroides fragilis metallo-beta-lactamase. Chem Biol 5:185-96 (1998)  
Target
Name:
Dipeptidase 1
Synonyms:
DPEP1 Dehydropeptidase-I Dipeptidase 1 Microsomal dipeptidase Renal dipeptidase | hRDP
Type:
Protein
Mol. Mass.:
45670.34
Organism:
Homo sapiens (Human)
Description:
P16444
Residue:
411
  
Inhibitor
Name:
BDBM36644
Synonyms:
L-159,906
Type:
Small oganic molecule
Emp. Form.:
C24H24N6OS
Mol. Mass.:
444.552
SMILES:
CCCCc1nc2CCSc2c(=O)n1Cc1ccc(cc1)-c1ccccc1-c1nnn[nH]1
: