Target
Gag-Pol polyprotein [588-1027]/[588-1147]
Ligand
BDBM1055
Substrate
(poly)rC:(oligo)dG
Meas. Tech.
HIV-1 RT Assay
pH
8.2±n/a
IC50
8100±733 nM
Citation
 Hoffman, JMWai, JSThomas, CMLevin, RBO'Brien, JAGoldman, ME Synthesis and evaluation of 2-pyridinone derivatives as HIV-1 specific reverse transcriptase inhibitors. 1. Phthalimidoalkyl and -alkylamino analogues. J Med Chem 35:3784-91 (1992)  
Target
Name:
Gag-Pol polyprotein [588-1027]/[588-1147]
Synonyms:
EC: 2.7.7.49 | HIV-1 Reverse Transcriptase
Type:
Protein Complex
Mol. Mass.:
115684
Description:
Components:
This complex has 2 components.
Component 1
Name:
Gag-Pol polyprotein [588-1147]
Synonyms:
HIV-1 Reverse Transcriptase Chain A gag-pol
Type:
Enzyme Subunit
Mol. Mass.:
64486.41
Organism:
Human immunodeficiency virus type 1
Description:
P04585[588-1147]
Residue:
560
  
Component 2
Name:
Gag-Pol polyprotein [588-1027]
Synonyms:
HIV-1 Reverse Transcriptase Chain B gag-pol
Type:
Enzyme Subunit
Mol. Mass.:
51337.13
Organism:
Human immunodeficiency virus type 1
Description:
P04585[588-1027]
Residue:
440
  
Inhibitor
Name:
BDBM1055
Synonyms:
2-pyridinone deriv. 10 3-[N-(Phthalimidomethyl)amino]-6-methylpyridin-2(1H)-one
Type:
Small organic molecule
Emp. Form.:
C15H13N3O3
Mol. Mass.:
283.282
SMILES:
Cc1ccc(NCN2C(=O)c3ccccc3C2=O)c(=O)[nH]1
:
Substrate
Name:
(poly)rC:(oligo)dG
Synonyms:
Type:
RNA-DNA duplex
Mol. Mass.:
358.43
Organism:
Description:
The incorporation of Tritium-labeled [3H]dGTP onto a (poly)rC:(oligo)dG template:primer.
Residue:
3
NA