Target
Gag-Pol polyprotein [588-1027]/[588-1147]
Ligand
BDBM1064
Substrate
(poly)rC:(oligo)dG
Meas. Tech.
HIV-1 RT Assay
pH
8.2±n/a
IC50
>300000±n/a nM
Citation
 Hoffman, JMWai, JSThomas, CMLevin, RBO'Brien, JAGoldman, ME Synthesis and evaluation of 2-pyridinone derivatives as HIV-1 specific reverse transcriptase inhibitors. 1. Phthalimidoalkyl and -alkylamino analogues. J Med Chem 35:3784-91 (1992)  
Target
Name:
Gag-Pol polyprotein [588-1027]/[588-1147]
Synonyms:
EC: 2.7.7.49 | HIV-1 Reverse Transcriptase
Type:
Protein Complex
Mol. Mass.:
115684
Description:
Components:
This complex has 2 components.
Component 1
Name:
Gag-Pol polyprotein [588-1147]
Synonyms:
HIV-1 Reverse Transcriptase Chain A gag-pol
Type:
Enzyme Subunit
Mol. Mass.:
64486.41
Organism:
Human immunodeficiency virus type 1
Description:
P04585[588-1147]
Residue:
560
  
Component 2
Name:
Gag-Pol polyprotein [588-1027]
Synonyms:
HIV-1 Reverse Transcriptase Chain B gag-pol
Type:
Enzyme Subunit
Mol. Mass.:
51337.13
Organism:
Human immunodeficiency virus type 1
Description:
P04585[588-1027]
Residue:
440
  
Inhibitor
Name:
BDBM1064
Synonyms:
2-[2-(2-oxo-1,2-dihydropyridin-3-yl)ethyl]-2,3-dihydro-1H-isoindole-1,3-dione | 2-pyridinone deriv. 18
Type:
Small organic molecule
Emp. Form.:
C15H12N2O3
Mol. Mass.:
268.2674
SMILES:
O=C1N(CCc2ccc[nH]c2=O)C(=O)c2ccccc12
:
Substrate
Name:
(poly)rC:(oligo)dG
Synonyms:
Type:
RNA-DNA duplex
Mol. Mass.:
358.43
Organism:
Description:
The incorporation of Tritium-labeled [3H]dGTP onto a (poly)rC:(oligo)dG template:primer.
Residue:
3
NA