Target
Serine/threonine-protein kinase 3
Ligand
BDBM31099
Substrate
Meas. Tech.
Kinase Inhibitor Selectivity Profiling Assay
Kd
9400±n/a nM
Citation
 PubChem, PC Kinase Inhibitor Selectivity Profiling Assay PubChem Bioassay (2008)[AID] 
Target
Name:
Serine/threonine-protein kinase 3
Synonyms:
KRS1 MST2 STE20-Like Kinase MST2 STK3_HUMAN Serine/threonine-protein kinase 3 (MST2) Serine/threonine-protein kinase Krs-1 | Serine/threonine-protein kinase MST2
Type:
Serine/threonine-protein kinase
Mol. Mass.:
56284.87
Organism:
Homo sapiens (Human)
Description:
Residue:
491
  
Inhibitor
Name:
BDBM31099
Synonyms:
2-(2-chlorophenyl)-5,7-dihydroxy-8-[(3S)-3-hydroxy-1-methyl-4-piperidinyl]-1-benzopyran-4-one 2-(2-chlorophenyl)-5,7-dihydroxy-8-[(3S)-3-hydroxy-1-methylpiperidin-4-yl]chromen-4-one CHEMBL45741 cid_24867231
Type:
Small organic molecule
Emp. Form.:
C21H20ClNO5
Mol. Mass.:
401.84
SMILES:
CN1CCC([C@H](O)C1)c1c(O)cc(O)c2c1oc(cc2=O)-c1ccccc1Cl
: