Target
Dimer of Gag-Pol polyprotein [489-587]
Ligand
BDBM1082
Substrate
Fluorescent peptide substrate
Meas. Tech.
Protease Inhibition Assay
pH
5.5±n/a
Temperature
310.15±n/a K
Ki
8000±n/a nM
Citation
 De Lucca, GVLiang, JAldrich, PECalabrese, JCordova, BKlabe, RMRayner, MMChang, CH Design, synthesis, and evaluation of tetrahydropyrimidinones as an example of a general approach to nonpeptide HIV protease inhibitors. J Med Chem 40:1707-9 (1997)  
Target
Name:
Dimer of Gag-Pol polyprotein [489-587]
Synonyms:
HIV-1 Protease
Type:
Tandem linked enzyme construct
Mol. Mass.:
Description:
Components:
This complex has 2 components.
Component 1
Name:
Gag-Pol polyprotein [489-587]
Synonyms:
Human immunodeficiency virus type 1 protease Pol polyprotein | gag-pol
Type:
Enzyme Subunit
Mol. Mass.:
10781.16
Organism:
Human immunodeficiency virus type 1
Description:
P04585[489-587]
Residue:
99
  
Component 2
Name:
Gag-Pol polyprotein [489-587]
Synonyms:
Human immunodeficiency virus type 1 protease Pol polyprotein | gag-pol
Type:
Enzyme Subunit
Mol. Mass.:
10781.16
Organism:
Human immunodeficiency virus type 1
Description:
P04585[489-587]
Residue:
99
  
Inhibitor
Name:
BDBM1082
Synonyms:
(4S,5S,6S)-Tetrahydro-1,3-bis[(3-cyanophenyl)methyl]-5-hydroxy-4-(2-phenylethyl)-6-(phenylmethyl)-2(1H)-pyrimidinone Tetrahydropyrimidinone deriv. 31
Type:
Small organic molecule
Emp. Form.:
C35H32N4O2
Mol. Mass.:
540.6542
SMILES:
O[C@H]1[C@H](CCc2ccccc2)N(Cc2cccc(c2)C#N)C(=O)N(Cc2cccc(c2)C#N)[C@H]1Cc1ccccc1
:
Substrate
Name:
Fluorescent peptide substrate
Synonyms:
Type:
Peptide
Mol. Mass.:
4608.75
Organism:
Description:
Residue:
42