Target
Tyrosine-protein kinase receptor Tie-1
Ligand
BDBM4779
Substrate
Meas. Tech.
Kinase Inhibitor Selectivity Profiling Assay
Kd
2200±n/a nM
Citation
 PubChem, PC Kinase Inhibitor Selectivity Profiling Assay PubChem Bioassay (2008)[AID] 
Target
Name:
Tyrosine-protein kinase receptor Tie-1
Synonyms:
TIE TIE1_HUMAN
Type:
PROTEIN
Mol. Mass.:
125096.89
Organism:
Homo sapiens (Human)
Description:
ChEMBL_1498731
Residue:
1138
  
Inhibitor
Name:
BDBM4779
Synonyms:
CHEMBL31965 CI-1033 N-{4-[(3-chloro-4-fluorophenyl)amino]-7-[3-(morpholin-4-yl)propoxy]quinazolin-6-yl}prop-2-enamide US10507209, Compound CI-1033 cid_156414
Type:
Small organic molecule
Emp. Form.:
C24H25ClFN5O3
Mol. Mass.:
485.938
SMILES:
Fc1ccc(Nc2ncnc3cc(OCCCN4CCOCC4)c(NC(=O)C=C)cc23)cc1Cl
: