Target
Tyrosine-protein kinase receptor Tie-1
Ligand
BDBM16673
Substrate
Meas. Tech.
Kinase Inhibitor Selectivity Profiling Assay
Kd
68±n/a nM
Citation
 PubChem, PC Kinase Inhibitor Selectivity Profiling Assay PubChem Bioassay (2008)[AID] 
Target
Name:
Tyrosine-protein kinase receptor Tie-1
Synonyms:
TIE TIE1_HUMAN
Type:
PROTEIN
Mol. Mass.:
125096.89
Organism:
Homo sapiens (Human)
Description:
ChEMBL_1498731
Residue:
1138
  
Inhibitor
Name:
BDBM16673
Synonyms:
4-[4-({[4-chloro-3-(trifluoromethyl)phenyl]carbamoyl}amino)phenoxy]-N-methylpyridine-2-carboxamide BAY 43-9006 BAY439006 Hit compound, 8 Sorafenib US10183928, Sorafenib US10227329, Compound Sorafenib US10774070, Compound Sorafenib US11279688, Compound Sorafenib US9029401, Sorafenib US9902709, Comparative example 1 cid_216239
Type:
Small organic molecule
Emp. Form.:
C21H16ClF3N4O3
Mol. Mass.:
464.825
SMILES:
CNC(=O)c1cc(Oc2ccc(NC(=O)Nc3ccc(Cl)c(c3)C(F)(F)F)cc2)ccn1
: