Target
Vitamin D-binding protein
Ligand
BDBM36722
Substrate
Meas. Tech.
DBP Binding Assay
pH
7.4±0
Temperature
277.15±0 K
IC50
>1000±0.0 nM
Citation
 Boehm, MFFitzgerald, PZou, AElgort, MGBischoff, EDMere, LMais, DEBissonnette, RPHeyman, RANadzan, AMReichman, MAllegretto, EA Novel nonsecosteroidal vitamin D mimics exert VDR-modulating activities with less calcium mobilization than 1,25-dihydroxyvitamin D3. Chem Biol 6:265-75 (1999)  
Target
Name:
Vitamin D-binding protein
Synonyms:
Type:
PROTEIN
Mol. Mass.:
52955.57
Organism:
Homo sapiens (Human)
Description:
ChEMBL_622880
Residue:
474
  
Inhibitor
Name:
BDBM36722
Synonyms:
LG190178
Type:
Small organic molecule
Emp. Form.:
C28H40O5
Mol. Mass.:
456.6142
SMILES:
CCC(CC)(c1ccc(OCC(O)CO)c(C)c1)c1ccc(OCC(=O)C(C)(C)C)c(C)c1
: