Target
Retinoic acid receptor gamma [183-417]
Ligand
BDBM31889
Substrate
Meas. Tech.
Competitive Assay
pH
8±0
Temperature
277.15±0 K
Ki
1.5±0.0 nM
Citation
 Géhin, MVivat, VWurtz, JMLosson, RChambon, PMoras, DGronemeyer, H Structural basis for engineering of retinoic acid receptor isotype-selective agonists and antagonists. Chem Biol 6:519-29 (1999)  
Target
Name:
Retinoic acid receptor gamma [183-417]
Synonyms:
NR1B3 RAR-gamma RARG_HUMAN | Retinoic Acid Receptor, gamma
Type:
Ligand-binding domain
Mol. Mass.:
26502.27
Organism:
Homo sapiens (Human)
Description:
P13631[183-417]
Residue:
235
  
Inhibitor
Name:
BDBM31889
Synonyms:
BMS 961 BMS961
Type:
Small organic molecule
Emp. Form.:
C23H26FNO4
Mol. Mass.:
399.4552
SMILES:
CC1(C)CCC(C)(C)c2cc(ccc12)[C@@H](O)C(=O)Nc1ccc(cc1F)C(O)=O
: