Target
Serine/threonine-protein kinase TNNI3K
Ligand
BDBM13530
Substrate
Meas. Tech.
Kinase Inhibitor Selectivity Profiling Assay
Kd
4300±n/a nM
Citation
 PubChem, PC Kinase Inhibitor Selectivity Profiling Assay PubChem Bioassay (2008)[AID] 
Target
Name:
Serine/threonine-protein kinase TNNI3K
Synonyms:
CARK TNI3K_HUMAN | TNNI3K
Type:
Enzyme Catalytic Domain
Mol. Mass.:
92855.14
Organism:
Homo sapiens (Human)
Description:
gi_7705748
Residue:
835
  
Inhibitor
Name:
BDBM13530
Synonyms:
4-[(4-methylpiperazin-1-yl)methyl]-N-[4-methyl-3-[(4-pyridin-3-ylpyrimidin-2-yl)amino]phenyl]benzamide Gleevec Imatinib, 21 STI-571 US10906896, Cpd imatinib US11725005, Compound imatinib cid_5291 med.21724, Compound 6
Type:
Small organic molecule
Emp. Form.:
C29H31N7O
Mol. Mass.:
493.6027
SMILES:
CN1CCN(Cc2ccc(cc2)C(=O)Nc2ccc(C)c(Nc3nccc(n3)-c3cccnc3)c2)CC1
: