Target
Tyrosine-protein kinase ABL1 [1-999,Q252H]
Ligand
BDBM31096
Substrate
Meas. Tech.
Kinase Inhibitor Selectivity Profiling Assay
Kd
91000±n/a nM
Citation
 PubChem, PC Kinase Inhibitor Selectivity Profiling Assay PubChem Bioassay (2008)[AID] 
Target
Name:
Tyrosine-protein kinase ABL1 [1-999,Q252H]
Synonyms:
ABL ABL1(Q252H) JTK7 Tyrosine-protein kinase ABL (dephosphorylated)
Type:
Enzyme Catalytic Domain
Mol. Mass.:
108590.01
Organism:
Homo sapiens (Human)
Description:
gi_62362414
Residue:
999
  
Inhibitor
Name:
BDBM31096
Synonyms:
CHEMBL290084 cid_451705
Type:
Small organic molecule
Emp. Form.:
C28H26N4O3
Mol. Mass.:
466.531
SMILES:
CN[C@H]1C[C@@H]2O[C@](C)([C@H]1OC)n1c3ccccc3c3c4CNC(=O)c4c4c5ccccc5n2c4c13
: