Target
5-hydroxytryptamine receptor 1A
Ligand
BDBM264092
Substrate
Meas. Tech.
Rat Synaptosome Binding Assay
pH
7.4±n/a
IC50
6.30±n/a nM
Comments
extracted
Citation
 Zhang, YJin, CZhou, R Substituted piperazine compounds and methods of use thereof US Patent  US9714232 Publication Date 7/25/2017 
Target
Name:
5-hydroxytryptamine receptor 1A
Synonyms:
5-HT-1A 5-HT1A 5-hydroxytryptamine receptor 1A (5HT1A) 5ht1a Htr1a Serotonin 1a (5-HT1a) receptor/Adrenergic receptor alpha-1 | Serotonin receptor 1A
Type:
G Protein-Coupled Receptor (GPCR)
Mol. Mass.:
46445.29
Organism:
Rattus norvegicus (rat)
Description:
Binding assays were performed using rat hippocampal membranes.
Residue:
422
  
Inhibitor
Name:
BDBM264092
Synonyms:
4-(4-(4-(4-(5-fluoro-1H-indol-3-yl)butyl)piperazin-1-yl)phenyl)morpholin-3-one | US9714232, 5
Type:
Small organic molecule
Emp. Form.:
C26H31FN4O2
Mol. Mass.:
450.5483
SMILES:
Fc1ccc2[nH]cc(CCCCN3CCN(CC3)c3ccc(cc3)N3CCOCC3=O)c2c1
: