Target
5-hydroxytryptamine receptor 1A
Ligand
BDBM264108
Substrate
Meas. Tech.
Rat Synaptosome Binding Assay
pH
7.4±n/a
IC50
7.40±n/a nM
Comments
extracted
Citation
 Zhang, YJin, CZhou, R Substituted piperazine compounds and methods of use thereof US Patent  US9714232 Publication Date 7/25/2017 
Target
Name:
5-hydroxytryptamine receptor 1A
Synonyms:
5-HT-1A 5-HT1A 5-hydroxytryptamine receptor 1A (5HT1A) 5ht1a Htr1a Serotonin 1a (5-HT1a) receptor/Adrenergic receptor alpha-1 | Serotonin receptor 1A
Type:
G Protein-Coupled Receptor (GPCR)
Mol. Mass.:
46445.29
Organism:
Rattus norvegicus (rat)
Description:
Binding assays were performed using rat hippocampal membranes.
Residue:
422
  
Inhibitor
Name:
BDBM264108
Synonyms:
3-(4-(4-(4-(4-methoxy-2-oxopyridin-1(2H)-yl)phenyl)piperazin-1-yl)butyl)-1H-indole-5-carbonitrile | US9714232, 21
Type:
Small organic molecule
Emp. Form.:
C29H31N5O2
Mol. Mass.:
481.5887
SMILES:
COc1ccn(-c2ccc(cc2)N2CCN(CCCCc3c[nH]c4ccc(cc34)C#N)CC2)c(=O)c1
: