Target
Fibroblast growth factor receptor 4
Ligand
BDBM88657
Substrate
Meas. Tech.
Omnia Assay
pH
7.5±n/a
IC50
<100±n/a nM
Comments
extracted
Citation
 D'Agostino, LASjin, RTNiu, DMcDonald, JJZhu, ZLiu, HMazdiyasni, HPetter, RCSingh, JBarrague, MGross, AMunson, M Heteroaryl compounds and uses thereof US Patent  US9695132 Publication Date 7/4/2017 
Target
Name:
Fibroblast growth factor receptor 4
Synonyms:
CD_antigen: CD334 FGFR4 FGFR4 Fibroblast growth factor receptor JK2 TKF
Type:
Protein
Mol. Mass.:
87957.45
Organism:
Homo sapiens (Human)
Description:
P22455
Residue:
802
  
Inhibitor
Name:
BDBM88657
Synonyms:
US10189794, Compound I-20 US10774052, Compound I-20 | US9695132, I-20
Type:
Small organic molecule
Emp. Form.:
C31H38N8O5
Mol. Mass.:
602.684
SMILES:
COCCN1CCN(CC1)c1ccc(Nc2ncc3CN(C(=O)N(C)c3n2)c2cc(OC)cc(OC)c2)c(NC(=O)C=C)c1
: