Target
Fibroblast growth factor receptor 4
Ligand
BDBM91865
Substrate
Meas. Tech.
Omnia Assay
pH
7.5±n/a
IC50
>1000±n/a nM
Comments
extracted
Citation
 D'Agostino, LASjin, RTNiu, DMcDonald, JJZhu, ZLiu, HMazdiyasni, HPetter, RCSingh, JBarrague, MGross, AMunson, M Heteroaryl compounds and uses thereof US Patent  US9695132 Publication Date 7/4/2017 
Target
Name:
Fibroblast growth factor receptor 4
Synonyms:
CD_antigen: CD334 FGFR4 FGFR4 Fibroblast growth factor receptor JK2 TKF
Type:
Protein
Mol. Mass.:
87957.45
Organism:
Homo sapiens (Human)
Description:
P22455
Residue:
802
  
Inhibitor
Name:
BDBM91865
Synonyms:
US10189794, Compound I-66 US10774052, Compound I-66 | US9695132, I-66
Type:
Small organic molecule
Emp. Form.:
C30H32Cl2N6O4
Mol. Mass.:
611.519
SMILES:
COc1cc(OC)c(Cl)c(N2Cc3cnc(N[C@H]4CCCC[C@H]4NC(=O)C=C)nc3N(Cc3ccccc3)C2=O)c1Cl
: