Target
Fibroblast growth factor receptor 4
Ligand
BDBM91876
Substrate
Meas. Tech.
Omnia Assay
pH
7.5±n/a
IC50
<100±n/a nM
Comments
extracted
Citation
 D'Agostino, LASjin, RTNiu, DMcDonald, JJZhu, ZLiu, HMazdiyasni, HPetter, RCSingh, JBarrague, MGross, AMunson, M Heteroaryl compounds and uses thereof US Patent  US9695132 Publication Date 7/4/2017 
Target
Name:
Fibroblast growth factor receptor 4
Synonyms:
CD_antigen: CD334 FGFR4 FGFR4 Fibroblast growth factor receptor JK2 TKF
Type:
Protein
Mol. Mass.:
87957.45
Organism:
Homo sapiens (Human)
Description:
P22455
Residue:
802
  
Inhibitor
Name:
BDBM91876
Synonyms:
US10189794, Compound I-75 US10774052, Compound I-75 | US9695132, I-75
Type:
Small organic molecule
Emp. Form.:
C24H23ClN6O4
Mol. Mass.:
494.93
SMILES:
COc1cc(OC)c(Cl)c(c1)N1Cc2cnc(Nc3ccccc3NC(=O)C=C)nc2N(C)C1=O
: