Target
Fibroblast growth factor receptor 4
Ligand
BDBM101142
Substrate
Meas. Tech.
Omnia Assay
pH
7.5±n/a
IC50
<100±n/a nM
Comments
extracted
Citation
 D'Agostino, LASjin, RTNiu, DMcDonald, JJZhu, ZLiu, HMazdiyasni, HPetter, RCSingh, JBarrague, MGross, AMunson, M Heteroaryl compounds and uses thereof US Patent  US9695132 Publication Date 7/4/2017 
Target
Name:
Fibroblast growth factor receptor 4
Synonyms:
CD_antigen: CD334 FGFR4 FGFR4 Fibroblast growth factor receptor JK2 TKF
Type:
Protein
Mol. Mass.:
87957.45
Organism:
Homo sapiens (Human)
Description:
P22455
Residue:
802
  
Inhibitor
Name:
BDBM101142
Synonyms:
US10189794, Compound I-116 US10774052, Compound I-116 | US9695132, I-116
Type:
Small organic molecule
Emp. Form.:
C25H22F4N6O4
Mol. Mass.:
546.4736
SMILES:
COc1cc(OC)c(F)c(N2Cc3cnc(Nc4ccccc4NC(=O)C=C)nc3N(CC(F)F)C2=O)c1F
: