Target
Fibroblast growth factor receptor 4
Ligand
BDBM94676
Substrate
Meas. Tech.
Omnia Assay
pH
7.5±n/a
IC50
<100±n/a nM
Comments
extracted
Citation
 D'Agostino, LASjin, RTNiu, DMcDonald, JJZhu, ZLiu, HMazdiyasni, HPetter, RCSingh, JBarrague, MGross, AMunson, M Heteroaryl compounds and uses thereof US Patent  US9695132 Publication Date 7/4/2017 
Target
Name:
Fibroblast growth factor receptor 4
Synonyms:
CD_antigen: CD334 FGFR4 FGFR4 Fibroblast growth factor receptor JK2 TKF
Type:
Protein
Mol. Mass.:
87957.45
Organism:
Homo sapiens (Human)
Description:
P22455
Residue:
802
  
Inhibitor
Name:
BDBM94676
Synonyms:
US10189794, Compound I-123 US10774052, Compound I-123 | US9695132, I-123
Type:
Small organic molecule
Emp. Form.:
C32H34Cl2N8O7
Mol. Mass.:
713.568
SMILES:
COc1cc(OC)c(Cl)c(N2Cc3cnc(Nc4ccc(cc4NC(=O)C=C)N4CCN(CC4)C(=O)CCC(O)=O)nc3N(C)C2=O)c1Cl
: