Target
Dimer of Gag-Pol polyprotein [489-587]
Ligand
BDBM1275
Substrate
Peptide substrate
Meas. Tech.
Protease Inhibition Assay
pH
5.5±n/a
Temperature
303.15±n/a K
IC50
0.44±n/a nM
Citation
 deSolms, SJGiuliani, EAGuare, JPVacca, JPSanders, WMGraham, SLWiggins, JMDarke, PLSigal, ISZugay, JA Design and synthesis of HIV protease inhibitors. Variations of the carboxy terminus of the HIV protease inhibitor L-682,679. J Med Chem 34:2852-7 (1991)  
Target
Name:
Dimer of Gag-Pol polyprotein [489-587]
Synonyms:
HIV-1 Protease
Type:
Tandem linked enzyme construct
Mol. Mass.:
Description:
Components:
This complex has 2 components.
Component 1
Name:
Gag-Pol polyprotein [489-587]
Synonyms:
Human immunodeficiency virus type 1 protease Pol polyprotein | gag-pol
Type:
Enzyme Subunit
Mol. Mass.:
10781.16
Organism:
Human immunodeficiency virus type 1
Description:
P04585[489-587]
Residue:
99
  
Component 2
Name:
Gag-Pol polyprotein [489-587]
Synonyms:
Human immunodeficiency virus type 1 protease Pol polyprotein | gag-pol
Type:
Enzyme Subunit
Mol. Mass.:
10781.16
Organism:
Human immunodeficiency virus type 1
Description:
P04585[489-587]
Residue:
99
  
Inhibitor
Name:
BDBM1275
Synonyms:
L-682, 679 analog 34 | tert-butyl N-[(2S,3S,5R)-5-benzyl-3-hydroxy-5-{[(1S)-1-[(2-hydroxyethyl)carbamoyl]-2-methylpropyl]carbamoyl}-1-phenylpentan-2-yl]carbamate
Type:
Small organic molecule
Emp. Form.:
C31H45N3O6
Mol. Mass.:
555.7055
SMILES:
CC(C)[C@H](NC(=O)[C@@H](C[C@H](O)[C@H](Cc1ccccc1)NC(=O)OC(C)(C)C)Cc1ccccc1)C(=O)NCCO
:
Substrate
Name:
Peptide substrate
Synonyms:
Type:
Peptide
Mol. Mass.:
4618.57
Organism:
Description:
Residue:
43