Target
Dual specificity testis-specific protein kinase 1
Ligand
BDBM21
Substrate
Meas. Tech.
Kinase Inhibitor Selectivity Profiling Assay
Kd
3700±n/a nM
Citation
 PubChem, PC Kinase Inhibitor Selectivity Profiling Assay PubChem Bioassay (2008)[AID] 
Target
Name:
Dual specificity testis-specific protein kinase 1
Synonyms:
TESK1 | TESK1_HUMAN
Type:
PROTEIN
Mol. Mass.:
67696.22
Organism:
Homo sapiens (Human)
Description:
ChEMBL_587103
Residue:
626
  
Inhibitor
Name:
BDBM21
Synonyms:
CHEMBL24828 VANDETANIB ZD6474 | cid_3081361
Type:
Emp. Form.:
C22H24BrFN4O2
Mol. Mass.:
475.354
SMILES:
COc1cc2c(Nc3ccc(Br)cc3F)ncnc2cc1OCC1CCN(C)CC1
: