Target
Receptor tyrosine-protein kinase erbB-2
Ligand
BDBM264160
Substrate
Meas. Tech.
N87 Assay
IC50
1.60±n/a nM
Citation
 Wang, WZhao, XLi, TTian, QChen, LZhou, ZLi, ZWang, XRong, YJiang, LLiu, YSun, JZeng, F Quinazoline derivatives, compositions thereof, and use as pharmaceuticals US Patent  US9714235 Publication Date 7/25/2017 
Target
Name:
Receptor tyrosine-protein kinase erbB-2
Synonyms:
2.7.10.1 CD_antigen=CD340 ERBB2_HUMAN FASN/HER2 HER2 MLN19 NEU Proto-oncogene Neu Tyrosine kinase-type cell surface receptor HER2 | p185erbB2
Type:
Mol. Mass.:
137894.47
Organism:
Homo sapiens (Human)
Description:
P04626
Residue:
1255
  
Inhibitor
Name:
BDBM264160
Synonyms:
(R,E)-N-(4-(3-chloro-4-fluorophenylamino)-7-ethoxyquinazolin-6-yl)-4-(2-(methoxymethyl)azetidin-1-yl)but-2-enamide | US9714235, 4
Type:
Small organic molecule
Emp. Form.:
C25H27ClFN5O3
Mol. Mass.:
499.965
SMILES:
CCOc1cc2ncnc(Nc3ccc(F)c(Cl)c3)c2cc1NC(=O)\C=C\CN1CC[C@@H]1COC
: