Target
Receptor tyrosine-protein kinase erbB-2
Ligand
BDBM264174
Substrate
Meas. Tech.
N87 Assay
IC50
11.2±n/a nM
Citation
 Wang, WZhao, XLi, TTian, QChen, LZhou, ZLi, ZWang, XRong, YJiang, LLiu, YSun, JZeng, F Quinazoline derivatives, compositions thereof, and use as pharmaceuticals US Patent  US9714235 Publication Date 7/25/2017 
Target
Name:
Receptor tyrosine-protein kinase erbB-2
Synonyms:
2.7.10.1 CD_antigen=CD340 ERBB2_HUMAN FASN/HER2 HER2 MLN19 NEU Proto-oncogene Neu Tyrosine kinase-type cell surface receptor HER2 | p185erbB2
Type:
Mol. Mass.:
137894.47
Organism:
Homo sapiens (Human)
Description:
P04626
Residue:
1255
  
Inhibitor
Name:
BDBM264174
Synonyms:
(E)-N-(7-((1R,5S,6R)-3-oxabicyclo[3.1.0]hexan-6-ylmethoxy)-4-(3-chloro-4-fluorophenylamino)quinazolin-6-yl)-4-(2-(hydroxymethyl)azetidin-1-yl)but-2-enamide | US9714235, 18
Type:
Small organic molecule
Emp. Form.:
C28H29ClFN5O4
Mol. Mass.:
554.012
SMILES:
OCC1CCN1C\C=C\C(=O)Nc1cc2c(Nc3ccc(F)c(Cl)c3)ncnc2cc1OC[C@H]1[C@@H]2COC[C@H]12
: