Target
Mitogen-activated protein kinase 6
Ligand
BDBM5931
Substrate
Meas. Tech.
Kinase Inhibitor Selectivity Profiling Assay
Kd
500±n/a nM
Citation
 PubChem, PC Kinase Inhibitor Selectivity Profiling Assay PubChem Bioassay (2008)[AID] 
Target
Name:
Mitogen-activated protein kinase 6
Synonyms:
ERK3 MK06_HUMAN | PRKM6
Type:
PROTEIN
Mol. Mass.:
82643.07
Organism:
Homo sapiens (Human)
Description:
ChEMBL_774367
Residue:
721
  
Inhibitor
Name:
BDBM5931
Synonyms:
BMS-387072 N-(5-{[(5-tert-butyl-1,3-oxazol-2-yl)methyl]sulfanyl}-1,3-thiazol-2-yl)piperidine-4-carboxamide cid_3025986
Type:
Small organic molecule
Emp. Form.:
C17H24N4O2S2
Mol. Mass.:
380.528
SMILES:
CC(C)(C)c1cnc(CSc2cnc(NC(=O)C3CCNCC3)s2)o1
: