Target
Tyrosine-protein kinase JAK2 [831-1132]
Ligand
BDBM264177
Substrate
Meas. Tech.
JAK Enzymatic Assay
pH
7.3±n/a
IC50
>30000±n/a nM
Comments
extracted
Citation
 Grimster, NKawatkar, SKettle, JGSu, QVasbinder, MChuaqui, CE Compounds and methods for inhibiting JAK US Patent  US9714236 Publication Date 7/25/2017 
Target
Name:
Tyrosine-protein kinase JAK2 [831-1132]
Synonyms:
JAK2 JAK2_HUMAN | Tyrosine-protein kinase JAK2 (aa 831-1132)
Type:
Enzyme Catalytic Domain
Mol. Mass.:
35337.99
Organism:
Homo sapiens (Human)
Description:
O60674[831-1132]
Residue:
302
  
Inhibitor
Name:
BDBM264177
Synonyms:
(2R)-2-[(2S)-2,4- dimethylpiperazin-1- yl]-N-(3-{2-[(3-methoxy-1- methyl-1H-pyrazol-4- yl)amino]pyrimidin-4-yl}- 1H-indol-7-yl)propanamide US10654835, Example 1 US9714236, 1
Type:
Small organic molecule
Emp. Form.:
C26H33N9O2
Mol. Mass.:
503.5993
SMILES:
COc1nn(C)cc1Nc1nccc(n1)-c1c[nH]c2c(NC(=O)[C@@H](C)N3CCN(C)C[C@@H]3C)cccc12
: