Target
Tyrosine-protein kinase JAK3 [781-1124]
Ligand
BDBM264190
Substrate
Meas. Tech.
JAK Enzymatic Assay
pH
7.3±n/a
IC50
>30000±n/a nM
Comments
extracted
Citation
 Grimster, NKawatkar, SKettle, JGSu, QVasbinder, MChuaqui, CE Compounds and methods for inhibiting JAK US Patent  US9714236 Publication Date 7/25/2017 
Target
Name:
Tyrosine-protein kinase JAK3 [781-1124]
Synonyms:
JAK3 JAK3_HUMAN Tyrosine-protein kinase JAK3 Tyrosine-protein kinase JAK3 (aa 781-1124)
Type:
Mol. Mass.:
38772.27
Organism:
Homo sapiens (Human)
Description:
P52333[781-1124]
Residue:
344
  
Inhibitor
Name:
BDBM264190
Synonyms:
(2S)-2-[(3S)-3,4- dimethylpiperazin-1- yl]-N-(3-{2-[(3-ethoxy- 1-methyl-1H- pyrazol-4-yl)amino]-5- fluoropyrimidin-4- yl}-1H-indol-7- yl)propanamide US10654835, Example 11b US9714236, 11b
Type:
Small organic molecule
Emp. Form.:
C27H34FN9O2
Mol. Mass.:
535.6164
SMILES:
CCOc1nn(C)cc1Nc1ncc(F)c(n1)-c1c[nH]c2c(NC(=O)[C@H](C)N3CCN(C)[C@@H](C)C3)cccc12
: