Target
Tyrosine-protein kinase JAK3 [781-1124]
Ligand
BDBM264207
Substrate
Meas. Tech.
JAK Enzymatic Assay
pH
7.3±n/a
IC50
>30000±n/a nM
Comments
extracted
Citation
 Grimster, NKawatkar, SKettle, JGSu, QVasbinder, MChuaqui, CE Compounds and methods for inhibiting JAK US Patent  US9714236 Publication Date 7/25/2017 
Target
Name:
Tyrosine-protein kinase JAK3 [781-1124]
Synonyms:
JAK3 JAK3_HUMAN Tyrosine-protein kinase JAK3 Tyrosine-protein kinase JAK3 (aa 781-1124)
Type:
Mol. Mass.:
38772.27
Organism:
Homo sapiens (Human)
Description:
P52333[781-1124]
Residue:
344
  
Inhibitor
Name:
BDBM264207
Synonyms:
(2R)-2-(4- ethylpiperidin-1-yl)-N-(3- {2-[(3-methoxy-1- methyl-1H-pyrazol- 4-yl)amino]pyrimidin- 4-yl}-1H-indol- 7-yl)propanamide US10654835, Example 28 US9714236, 28
Type:
Small organic molecule
Emp. Form.:
C26H33N9O2
Mol. Mass.:
503.5993
SMILES:
CCN1CCN(CC1)[C@H](C)C(=O)Nc1cccc2c(c[nH]c12)-c1ccnc(Nc2cn(C)nc2OC)n1
: