Target
Tyrosine-protein kinase JAK1 [866-1154]
Ligand
BDBM264226
Substrate
Meas. Tech.
JAK Enzymatic Assay
pH
7.3±n/a
IC50
986±n/a nM
Comments
extracted
Citation
 Grimster, NKawatkar, SKettle, JGSu, QVasbinder, MChuaqui, CE Compounds and methods for inhibiting JAK US Patent  US9714236 Publication Date 7/25/2017 
Target
Name:
Tyrosine-protein kinase JAK1 [866-1154]
Synonyms:
JAK1 JAK1A JAK1_HUMAN Tyrosine-protein kinase JAK1 (aa 866-1154)
Type:
Protein
Mol. Mass.:
33185.74
Organism:
Homo sapiens (Human)
Description:
P23458[866-1154]
Residue:
289
  
Inhibitor
Name:
BDBM264226
Synonyms:
(2S)-3-methoxy-N- (3-{2-[(3-methoxy- 1-methyl-1H-pyrazol- 4-yl)amino]-5- methylpyrimidin-4-yl}- 1H-indol-7-yl)- 2-(4-methylpiperazin-1- yl)propanamide US10654835, Example 46 US9714236, 46
Type:
Small organic molecule
Emp. Form.:
C27H35N9O3
Mol. Mass.:
533.6253
SMILES:
COC[C@H](N1CCN(C)CC1)C(=O)Nc1cccc2c(c[nH]c12)-c1nc(Nc2cn(C)nc2OC)ncc1C
: