Target
Tyrosine-protein kinase JAK2 [831-1132]
Ligand
BDBM264242
Substrate
Meas. Tech.
JAK Enzymatic Assay
pH
7.3±n/a
IC50
5010±n/a nM
Comments
extracted
Citation
 Grimster, NKawatkar, SKettle, JGSu, QVasbinder, MChuaqui, CE Compounds and methods for inhibiting JAK US Patent  US9714236 Publication Date 7/25/2017 
Target
Name:
Tyrosine-protein kinase JAK2 [831-1132]
Synonyms:
JAK2 JAK2_HUMAN | Tyrosine-protein kinase JAK2 (aa 831-1132)
Type:
Enzyme Catalytic Domain
Mol. Mass.:
35337.99
Organism:
Homo sapiens (Human)
Description:
O60674[831-1132]
Residue:
302
  
Inhibitor
Name:
BDBM264242
Synonyms:
(2R)-N-(3-{2-[(3- ethoxy-1-methyl-1H- pyrazol-4-yl)amino]-5- methylpyrimidin-4-yl}- 1H-indol-7-yl)- 2-(4-methylpiperazin-1- yl)butanamide US10654835, Example 62 US9714236, 62
Type:
Small organic molecule
Emp. Form.:
C28H37N9O2
Mol. Mass.:
531.6525
SMILES:
CCOc1nn(C)cc1Nc1ncc(C)c(n1)-c1c[nH]c2c(NC(=O)[C@@H](CC)N3CCN(C)CC3)cccc12
: