Target
NUAK family SNF1-like kinase 2
Ligand
BDBM25118
Substrate
Meas. Tech.
Kinase Inhibitor Selectivity Profiling Assay
Kd
130±n/a nM
Citation
 PubChem, PC Kinase Inhibitor Selectivity Profiling Assay PubChem Bioassay (2008)[AID] 
Target
Name:
NUAK family SNF1-like kinase 2
Synonyms:
NUAK2 OMPHK2 | SNARK
Type:
PROTEIN
Mol. Mass.:
69635.01
Organism:
Homo sapiens (Human)
Description:
ChEMBL_774619
Residue:
628
  
Inhibitor
Name:
BDBM25118
Synonyms:
(3Z)-4-amino-5-fluoro-3-[5-(4-methylpiperazino)-1,3-dihydrobenzimidazol-2-ylidene]carbostyril CHEMBL522892 | CHIR-258
Type:
Small organic molecule
Emp. Form.:
C21H21FN6O
Mol. Mass.:
392.4294
SMILES:
CN1CCN(CC1)c1ccc2nc([nH]c2c1)-c1c(N)c2c(F)cccc2[nH]c1=O
: