Target
Amine oxidase [flavin-containing] A
Ligand
BDBM256686
Substrate
Meas. Tech.
MAO-A Inhibitory Assay
pH
7.5±n/a
Temperature
298.15±n/a K
IC50
25000±n/a nM
Comments
extracted
Citation
 Matsumoto, SHattori, YToyofuku, MMorimoto, SKojima, TKaku, TIto, M Cyclopropanamine compound and use thereof US Patent  US9714241 Publication Date 7/25/2017 
Target
Name:
Amine oxidase [flavin-containing] A
Synonyms:
AOFA_HUMAN MAO-A Monoamine oxidase Monoamine oxidase type A (MAO A) Monoamine oxidase type A (MAOA)
Type:
Protein
Mol. Mass.:
59689.53
Organism:
Homo sapiens (Human)
Description:
P21397
Residue:
527
  
Inhibitor
Name:
BDBM256686
Synonyms:
US10053456, 65 US10968213, Example 65 US9718814, 65
Type:
Small organic molecule
Emp. Form.:
C19H26F2N2OS
Mol. Mass.:
368.484
SMILES:
Cc1sc(cc1C(=O)NC1CCC(F)(F)CC1)C1CC1NCC1CC1
: