Target
Amine oxidase [flavin-containing] A
Ligand
BDBM243996
Substrate
Meas. Tech.
MAO-A Inhibitory Assay
pH
7.5±n/a
Temperature
298.15±n/a K
IC50
36000±n/a nM
Comments
extracted
Citation
 Matsumoto, SHattori, YToyofuku, MMorimoto, SKojima, TKaku, TIto, M Cyclopropanamine compound and use thereof US Patent  US9714241 Publication Date 7/25/2017 
Target
Name:
Amine oxidase [flavin-containing] A
Synonyms:
AOFA_HUMAN MAO-A Monoamine oxidase Monoamine oxidase type A (MAO A) Monoamine oxidase type A (MAOA)
Type:
Protein
Mol. Mass.:
59689.53
Organism:
Homo sapiens (Human)
Description:
P21397
Residue:
527
  
Inhibitor
Name:
BDBM243996
Synonyms:
N-(5-methyl-1,2- oxazol-3-yl)-5- ((1R,2R)-2- ((tetrahydro-2H- pyran-4-ylmethyl)- amino)cyclopropyl)- thiophene-3- carboxamide US10414761, Example 81 US9920047, 81
Type:
Small organic molecule
Emp. Form.:
C18H23N3O3S
Mol. Mass.:
361.459
SMILES:
Cc1cc(NC(=O)c2csc(c2)[C@@H]2C[C@H]2NCC2CCOCC2)no1
: