Target
MAP/microtubule affinity-regulating kinase 4
Ligand
BDBM31095
Substrate
Meas. Tech.
Kinase Inhibitor Selectivity Profiling Assay
Kd
2000±n/a nM
Citation
 PubChem, PC Kinase Inhibitor Selectivity Profiling Assay PubChem Bioassay (2008)[AID] 
Target
Name:
MAP/microtubule affinity-regulating kinase 4
Synonyms:
KIAA1860 MARK4 MARKL1
Type:
PROTEIN
Mol. Mass.:
82561.08
Organism:
Homo sapiens (Human)
Description:
ChEMBL_774620
Residue:
752
  
Inhibitor
Name:
BDBM31095
Synonyms:
5-[(Z)-(5-fluoranyl-2-oxidanylidene-1H-indol-3-ylidene)methyl]-2,4-dimethyl-N-[(2S)-3-morpholin-4-yl-2-oxidanyl-propyl]-1H-pyrrole-3-carboxamide 5-[(Z)-(5-fluoro-2-oxo-1H-indol-3-ylidene)methyl]-N-[(2S)-2-hydroxy-3-(4-morpholinyl)propyl]-2,4-dimethyl-1H-pyrrole-3-carboxamide SU-14813 | cid_10138259
Type:
Small organic molecule
Emp. Form.:
C23H27FN4O4
Mol. Mass.:
442.4833
SMILES:
Cc1[nH]c(\C=C2/C(=O)Nc3ccc(F)cc23)c(C)c1C(=O)NC[C@H](O)CN1CCOCC1
: