Target
Phosphatidylinositol 4-phosphate 5-kinase type-1 alpha
Ligand
BDBM13534
Substrate
Meas. Tech.
Kinase Inhibitor Selectivity Profiling Assay
Kd
130±n/a nM
Citation
 PubChem, PC Kinase Inhibitor Selectivity Profiling Assay PubChem Bioassay (2008)[AID] 
Target
Name:
Phosphatidylinositol 4-phosphate 5-kinase type-1 alpha
Synonyms:
PI51A_HUMAN Phosphatidylinositol-4-phosphate 5-kinase type-1 alpha
Type:
PROTEIN
Mol. Mass.:
62644.19
Organism:
Homo sapiens (Human)
Description:
ChEMBL_774304
Residue:
562
  
Inhibitor
Name:
BDBM13534
Synonyms:
CHEMBL572878 N-[4-[[4-(4-methylpiperazino)-6-[(5-methyl-1H-pyrazol-3-yl)amino]pyrimidin-2-yl]thio]phenyl]cyclopropanecarboxamide VX680 | cyclopropane carboxylic acid {4-[4-(4-methyl-piperazin-1-yl)-6-(5-methyl-2H-pyrazol-3-ylamino)-pyrimidin-2ylsulphanyl]-phenyl}-amide
Type:
Small organic molecule
Emp. Form.:
C23H28N8OS
Mol. Mass.:
464.586
SMILES:
CN1CCN(CC1)c1cc(Nc2cc(C)n[nH]2)nc(Sc2ccc(NC(=O)C3CC3)cc2)n1
: