Target
Serine/threonine-protein kinase N1
Ligand
BDBM13534
Substrate
Meas. Tech.
Kinase Inhibitor Selectivity Profiling Assay
Kd
1500±n/a nM
Citation
 PubChem, PC Kinase Inhibitor Selectivity Profiling Assay PubChem Bioassay (2008)[AID] 
Target
Name:
Serine/threonine-protein kinase N1
Synonyms:
PAK1 PKN1 PRK1 Protein kinase N1 | Serine/threonine-protein kinase N1/Transforming protein RhoA
Type:
PROTEIN
Mol. Mass.:
103928.39
Organism:
Homo sapiens (Human)
Description:
ChEMBL_1433150
Residue:
942
  
Inhibitor
Name:
BDBM13534
Synonyms:
CHEMBL572878 N-[4-[[4-(4-methylpiperazino)-6-[(5-methyl-1H-pyrazol-3-yl)amino]pyrimidin-2-yl]thio]phenyl]cyclopropanecarboxamide VX680 | cyclopropane carboxylic acid {4-[4-(4-methyl-piperazin-1-yl)-6-(5-methyl-2H-pyrazol-3-ylamino)-pyrimidin-2ylsulphanyl]-phenyl}-amide
Type:
Small organic molecule
Emp. Form.:
C23H28N8OS
Mol. Mass.:
464.586
SMILES:
CN1CCN(CC1)c1cc(Nc2cc(C)n[nH]2)nc(Sc2ccc(NC(=O)C3CC3)cc2)n1
: