Target
Arachidonate 5-lipoxygenase-activating protein
Ligand
BDBM145686
Substrate
Meas. Tech.
FLAP Binding Assay
Ki
3.90±n/a nM
Citation
 Chai, WDvorak, CAEccles, WEdwards, JPGoldberg, SDKrawczuk, PJLebsack, ADLiu, JPippel, DJSales, ZSTanis, VMTichenor, MSWiener, JJ 1,2,6-substituted benzimidazoles as flap modulators US Patent  US9695149 Publication Date 7/4/2017 
Target
Name:
Arachidonate 5-lipoxygenase-activating protein
Synonyms:
5-lipoxygenase activating protein 5-lipoxygenase/FLAP ALOX5AP MK-886-binding protein
Type:
Enzyme
Mol. Mass.:
18159.90
Organism:
Homo sapiens (Human)
Description:
P20292
Residue:
161
  
Inhibitor
Name:
BDBM145686
Synonyms:
US8952177, 40 US9089569, 41 | US9695149, 41
Type:
Small organic molecule
Emp. Form.:
C26H27BrN4O3
Mol. Mass.:
523.422
SMILES:
Cn1ccc(COc2ccc3nc(C4CCCC[C@H]4C(O)=O)n(Cc4ccc(Br)cc4)c3c2)n1
: