Target
Arachidonate 5-lipoxygenase-activating protein
Ligand
BDBM145767
Substrate
Meas. Tech.
FLAP Binding Assay
Ki
150±n/a nM
Citation
 Chai, WDvorak, CAEccles, WEdwards, JPGoldberg, SDKrawczuk, PJLebsack, ADLiu, JPippel, DJSales, ZSTanis, VMTichenor, MSWiener, JJ 1,2,6-substituted benzimidazoles as flap modulators US Patent  US9695149 Publication Date 7/4/2017 
Target
Name:
Arachidonate 5-lipoxygenase-activating protein
Synonyms:
5-lipoxygenase activating protein 5-lipoxygenase/FLAP ALOX5AP MK-886-binding protein
Type:
Enzyme
Mol. Mass.:
18159.90
Organism:
Homo sapiens (Human)
Description:
P20292
Residue:
161
  
Inhibitor
Name:
BDBM145767
Synonyms:
US8952177, 121 US9695149, 121
Type:
Small organic molecule
Emp. Form.:
C28H29N3O3
Mol. Mass.:
455.5482
SMILES:
Cc1ccc(Cn2c(nc3ccc(OCc4ccc(C)cn4)cc23)[C@@H]2[C@H](C(O)=O)C2(C)C)cc1
: