Target
Arachidonate 5-lipoxygenase-activating protein
Ligand
BDBM145782
Substrate
Meas. Tech.
FLAP Binding Assay
Ki
0.64±n/a nM
Citation
 Chai, WDvorak, CAEccles, WEdwards, JPGoldberg, SDKrawczuk, PJLebsack, ADLiu, JPippel, DJSales, ZSTanis, VMTichenor, MSWiener, JJ 1,2,6-substituted benzimidazoles as flap modulators US Patent  US9695149 Publication Date 7/4/2017 
Target
Name:
Arachidonate 5-lipoxygenase-activating protein
Synonyms:
5-lipoxygenase activating protein 5-lipoxygenase/FLAP ALOX5AP MK-886-binding protein
Type:
Enzyme
Mol. Mass.:
18159.90
Organism:
Homo sapiens (Human)
Description:
P20292
Residue:
161
  
Inhibitor
Name:
BDBM145782
Synonyms:
US8952177, 136 US9695149, 136
Type:
Small organic molecule
Emp. Form.:
C28H29BrFN3O3
Mol. Mass.:
554.451
SMILES:
CCC(CC)(Cc1nc2ccc(OCc3ncc(C)cc3F)cc2n1Cc1ccc(Br)cc1)C(O)=O
: