Target
Arachidonate 5-lipoxygenase-activating protein
Ligand
BDBM145811
Substrate
Meas. Tech.
FLAP Binding Assay
Ki
2.20±n/a nM
Citation
 Chai, WDvorak, CAEccles, WEdwards, JPGoldberg, SDKrawczuk, PJLebsack, ADLiu, JPippel, DJSales, ZSTanis, VMTichenor, MSWiener, JJ 1,2,6-substituted benzimidazoles as flap modulators US Patent  US9695149 Publication Date 7/4/2017 
Target
Name:
Arachidonate 5-lipoxygenase-activating protein
Synonyms:
5-lipoxygenase activating protein 5-lipoxygenase/FLAP ALOX5AP MK-886-binding protein
Type:
Enzyme
Mol. Mass.:
18159.90
Organism:
Homo sapiens (Human)
Description:
P20292
Residue:
161
  
Inhibitor
Name:
BDBM145811
Synonyms:
US8952177, 167 US9695149, 167
Type:
Small organic molecule
Emp. Form.:
C31H31F3N4O3
Mol. Mass.:
564.598
SMILES:
Cc1ccc(COc2ccc3nc([C@@H]4CCCC[C@@H]4C(O)=O)n(Cc4ccc(cc4F)N4CC(F)(F)C4)c3c2)nc1
: