Target
Potassium voltage-gated channel subfamily H member 2
Ligand
BDBM264247
Substrate
Meas. Tech.
hERG Activity Assay
IC50
<10±n/a nM
Citation
 O Dowd, CRRountree, JSBurkamp, FWilkinson, AJ Substituted pyrido[4,3-d]pyrimidines as Wee-1 inhibitors US Patent  US9714244 Publication Date 7/25/2017 
Target
Name:
Potassium voltage-gated channel subfamily H member 2
Synonyms:
1,3-beta-glucan synthase component GLS2 ERG Eag-related protein 1 Ether-a-go-go-related gene (HERG) Ether-a-go-go-related gene potassium channel 1 Ether-a-go-go-related gene potassium channel 1 (hERG1) Ether-a-go-go-related protein 1 H-ERG KCNH2 Potassium voltage-gated channel subfamily H member 2 (hERG) Voltage-gated potassium channel subunit Kv11.1 hERG Potassium Channel 1 | putative potassium channel subunit
Type:
Multi-pass membrane protein
Mol. Mass.:
126672.65
Organism:
Homo sapiens (Human)
Description:
Q12809
Residue:
1159
  
Inhibitor
Name:
BDBM264247
Synonyms:
6-(2,6-Dichlorophenyl)-8-methyl-2-((4-(piperazin-1-yl)phenyl)amino)pyrido[4,3-d]pyrimidin-5(6H)-one | US9714244, 2
Type:
Small organic molecule
Emp. Form.:
C24H22Cl2N6O
Mol. Mass.:
481.377
SMILES:
Cc1cn(-c2c(Cl)cccc2Cl)c(=O)c2cnc(Nc3ccc(cc3)N3CCNCC3)nc12
: