Target
Potassium voltage-gated channel subfamily H member 2
Ligand
BDBM264252
Substrate
Meas. Tech.
hERG Activity Assay
IC50
105±n/a nM
Citation
 O Dowd, CRRountree, JSBurkamp, FWilkinson, AJ Substituted pyrido[4,3-d]pyrimidines as Wee-1 inhibitors US Patent  US9714244 Publication Date 7/25/2017 
Target
Name:
Potassium voltage-gated channel subfamily H member 2
Synonyms:
1,3-beta-glucan synthase component GLS2 ERG Eag-related protein 1 Ether-a-go-go-related gene (HERG) Ether-a-go-go-related gene potassium channel 1 Ether-a-go-go-related gene potassium channel 1 (hERG1) Ether-a-go-go-related protein 1 H-ERG KCNH2 Potassium voltage-gated channel subfamily H member 2 (hERG) Voltage-gated potassium channel subunit Kv11.1 hERG Potassium Channel 1 | putative potassium channel subunit
Type:
Multi-pass membrane protein
Mol. Mass.:
126672.65
Organism:
Homo sapiens (Human)
Description:
Q12809
Residue:
1159
  
Inhibitor
Name:
BDBM264252
Synonyms:
6-(2,6-Dichlorophenyl)-2-((3-methyl-4-(piperazin-1-yl)phenyl)amino)pyrido[4,3-d]pyrimidin-5(6H)-one | US9714244, 7
Type:
Small organic molecule
Emp. Form.:
C24H22Cl2N6O
Mol. Mass.:
481.377
SMILES:
Cc1cc(Nc2ncc3c(ccn(-c4c(Cl)cccc4Cl)c3=O)n2)ccc1N1CCNCC1
: