Target
Proto-oncogene tyrosine-protein kinase Src
Ligand
BDBM264342
Substrate
Meas. Tech.
Kinase Assays
IC50
<100.0±n/a nM
Citation
 Zeng, QFaris, MMollard, AWarner, SLFlynn, GA Multiple kinase pathway inhibitors US Patent  US9714247 Publication Date 7/25/2017 
Target
Name:
Proto-oncogene tyrosine-protein kinase Src
Synonyms:
Calmodulin/Proto-oncogene tyrosine-protein kinase Src Proto-oncogene c-Src SRC SRC_HUMAN V-src sarcoma (Schmidt-Ruppin A-2) viral oncogene homolog (avian) p60-Src | pp60c-src
Type:
Protein
Mol. Mass.:
59838.60
Organism:
Homo sapiens (Human)
Description:
P12931
Residue:
536
  
Inhibitor
Name:
BDBM264342
Synonyms:
US9714247, 63
Type:
Small organic molecule
Emp. Form.:
C20H17N5O2
Mol. Mass.:
359.3813
SMILES:
CCn1c2cc(Nc3ccnc(O)n3)ncc2cc(-c2ccccc2)c1=O
: