Target
Proto-oncogene tyrosine-protein kinase Src
Ligand
BDBM264423
Substrate
Meas. Tech.
Kinase Assays
IC50
<100.0±n/a nM
Citation
 Zeng, QFaris, MMollard, AWarner, SLFlynn, GA Multiple kinase pathway inhibitors US Patent  US9714247 Publication Date 7/25/2017 
Target
Name:
Proto-oncogene tyrosine-protein kinase Src
Synonyms:
Calmodulin/Proto-oncogene tyrosine-protein kinase Src Proto-oncogene c-Src SRC SRC_HUMAN V-src sarcoma (Schmidt-Ruppin A-2) viral oncogene homolog (avian) p60-Src | pp60c-src
Type:
Protein
Mol. Mass.:
59838.60
Organism:
Homo sapiens (Human)
Description:
P12931
Residue:
536
  
Inhibitor
Name:
BDBM264423
Synonyms:
US9714247, 145 | US9714247, 146
Type:
Small organic molecule
Emp. Form.:
C29H31Cl2N5O3
Mol. Mass.:
568.494
SMILES:
CCN(CC)CCOc1ccc(Nc2cc3n(C4CCOC4)c(=O)c(cc3cn2)-c2c(Cl)cccc2Cl)nc1
: