Target
Ribosomal protein S6 kinase alpha-1
Ligand
BDBM13531
Substrate
Meas. Tech.
Kinase Inhibitor Selectivity Profiling Assay
Ki
170000±n/a nM
Citation
 PubChem, PC Kinase Inhibitor Selectivity Profiling Assay PubChem Bioassay (2008)[AID] 
Target
Name:
Ribosomal protein S6 kinase alpha-1
Synonyms:
90 kDa ribosomal protein S6 kinase 1 MAP kinase-activated protein kinase 1a RPS6KA1 RPS6KA1(Kin.Dom.2 - C-terminal) RSK1 Ribosomal S6 kinase 1 Ribosomal protein S6 kinase alpha 1 Ribosomal protein S6 kinase alpha-1 (RSK1) p90-RSK 1 p90S6K | pp90RSK1
Type:
Serine/threonine-protein kinase
Mol. Mass.:
82736.10
Organism:
Homo sapiens (Human)
Description:
Residue:
735
  
Inhibitor
Name:
BDBM13531
Synonyms:
4-(4-Fluorophenyl)-2-(4-hydroxyphenyl)-5-(4-pyridyl)-1H-imidazole 4-[4-(4-fluorophenyl)-5-(4-pyridyl)-4-imidazolin-2-ylidene]cyclohexa-2,5-dien-1-one SB-202190 biotinylated SB202190
Type:
Small organic molecule
Emp. Form.:
C20H14FN3O
Mol. Mass.:
331.3431
SMILES:
Oc1ccc(cc1)-c1nc(c([nH]1)-c1ccc(F)cc1)-c1ccncc1
: