Target
Bromodomain-containing protein 4
Ligand
BDBM264431
Substrate
Meas. Tech.
TR-FRET In-Vitro Binding Assays for BRD2, BRD3, and BRD4
pH
7.5±n/a
IC50
28.0±n/a nM
Comments
extracted
Citation
 Blank, JCotesta, SGuagnano, VRueeger, H Pyrazolo-pyrrolidin-4-one derivatives and their use in the treatment of disease US Patent  US9714249 Publication Date 7/25/2017 
Target
Name:
Bromodomain-containing protein 4
Synonyms:
BRD4 Bromodomain-containing protein 4 (BRD4) Protein HUNK1
Type:
Protein
Mol. Mass.:
152264.84
Organism:
Homo sapiens (Human)
Description:
O60885
Residue:
1362
  
Inhibitor
Name:
BDBM264431
Synonyms:
6-(4-chlorophenyl)-3-cyclopropyl-5-(1,5-dimethyl-6-oxo-1,6-dihydropyridin-3-yl)-1-methyl-5,6-dihydropyrrolo[3,4-c]pyrazol-4(1H)-one | US9714249, 1
Type:
Small organic molecule
Emp. Form.:
C22H23ClN4O2
Mol. Mass.:
410.897
SMILES:
CNC1=C(C(=N)C2CC2)C(=O)N(C1c1ccc(Cl)cc1)c1cc(C)c(=O)n(C)c1
: