Target
Bromodomain-containing protein 3
Ligand
BDBM264437
Substrate
Meas. Tech.
TR-FRET In-Vitro Binding Assays for BRD2, BRD3, and BRD4
pH
7.5±n/a
IC50
65.0±n/a nM
Comments
extracted
Citation
 Blank, JCotesta, SGuagnano, VRueeger, H Pyrazolo-pyrrolidin-4-one derivatives and their use in the treatment of disease US Patent  US9714249 Publication Date 7/25/2017 
Target
Name:
Bromodomain-containing protein 3
Synonyms:
BRD3 Bromodomain and extra-terminal motif (BET) Bromodomain-containing protein 3 (BRD3) RING3-like protein | RING3L
Type:
Protein
Mol. Mass.:
79571.81
Organism:
Homo sapiens (Human)
Description:
Q15059
Residue:
726
  
Inhibitor
Name:
BDBM264437
Synonyms:
5-(5-chloro-1-methyl-6-oxo-1,6-dihydropyridin-3-yl)-6-(4-chlorophenyl)-1-(2-methoxypyridin-3-yl)-3-methyl-5,6-dihydropyrrolo[3,4-c]pyrazol-4(1H)-one | US9714249, 7a
Type:
Small organic molecule
Emp. Form.:
C24H19Cl2N5O3
Mol. Mass.:
496.345
SMILES:
COc1ncccc1-n1nc(C)c2C(=O)N(C(c12)c1ccc(Cl)cc1)c1cc(Cl)c(=O)n(C)c1
: